Target
Dual specificity mitogen-activated protein kinase kinase 1 [2-31,52-393,S218E,S222D]
Ligand
BDBM97648
Substrate
Meas. Tech.
Enzyme Assay
pH
7.3±0
Temperature
298.15±0 K
IC50
10±5 nM
Citation
 Dong, QKaldor, SW MAPK/ERK kinase inhibitors US Patent  US8470837 Publication Date 6/25/2013 
Target
Name:
Dual specificity mitogen-activated protein kinase kinase 1 [2-31,52-393,S218E,S222D]
Synonyms:
Dual specificity mitogen-activated protein kinase kinase 1 MEK1 PRKMK1
Type:
Protein
Mol. Mass.:
40898.07
Organism:
Homo sapiens (Human)
Description:
Q02750[2-31,52-393,S218E,S222D]
Residue:
372
  
Inhibitor
Name:
BDBM97648
Synonyms:
US8470837, 26
Type:
Small organic molecule
Emp. Form.:
C16H14FIN4O4
Mol. Mass.:
472.2096
SMILES:
Cn1c2ncn(OCCO)c(=O)c2c(Nc2ccc(I)cc2F)cc1=O
: