Target
Isocitrate dehydrogenase [NADP] cytoplasmic [R132H]
Ligand
BDBM279871
Substrate
Meas. Tech.
In Vitro Assays for IDH1m (R132H or R132C)
pH
7.5±n/a
Temperature
298.15±n/a K
IC50
<50±n/a nM
Comments
extracted
Citation
 Konteatis, ZDPopovici-Muller, JTravins, JMZahler, RCai, ZZhou, D Therapeutically active compounds and their methods of use US Patent  US10028961 Publication Date 7/24/2018 
Target
Name:
Isocitrate dehydrogenase [NADP] cytoplasmic [R132H]
Synonyms:
Cytosolic NADP-isocitrate dehydrogenase (IDH1)(R132H) IDH1 R132H IDHC_HUMAN Isocitrate dehydrogenase 1 mutant (R132H) Isocitrate dehydrogenase [NADP] cytoplasmic (IDH1)(R132H) PICD
Type:
Protein
Mol. Mass.:
46641.74
Organism:
Homo sapiens (Human)
Description:
Human IDH1 R132H (SEQ ID No. 2 in patent). First three are removed. Google patent parsed wrong.
Residue:
414
  
Inhibitor
Name:
BDBM279871
Synonyms:
US10028961, Compound 18 US10946023, Compound 18
Type:
Small organic molecule
Emp. Form.:
C19H27F3N6
Mol. Mass.:
396.4531
SMILES:
CC(C)[C@@H](C)Nc1nc(N[C@H](C)C(C)C)nc(n1)-c1cccc(n1)C(F)(F)F
: