Target
Isocitrate dehydrogenase [NADP], mitochondrial [R140Q]
Ligand
BDBM279956
Substrate
Meas. Tech.
In Vitro Assays for IDH2m R140Q Inhibitors
pH
7.5±n/a
Temperature
298.15±n/a K
IC50
<50±n/a nM
Comments
extracted
Citation
 Konteatis, ZDPopovici-Muller, JTravins, JMZahler, RCai, ZZhou, D Therapeutically active compounds and their methods of use US Patent  US10028961 Publication Date 7/24/2018 
Target
Name:
Isocitrate dehydrogenase [NADP], mitochondrial [R140Q]
Synonyms:
IDH2 IDHP_HUMAN | idh2 r140q
Type:
Enzyme Catalytic Domain
Mol. Mass.:
50823.17
Organism:
Homo sapiens (Human)
Description:
P48735 (R140Q)
Residue:
452
  
Inhibitor
Name:
BDBM279956
Synonyms:
US10028961, Compound 109 US10946023, Compound 109
Type:
Small organic molecule
Emp. Form.:
C18H14ClF4N7
Mol. Mass.:
439.797
SMILES:
Fc1cc(F)cc(Nc2nc(NC3CCC(F)(F)C3)nc(n2)-c2cncc(Cl)n2)c1
: