Target
Isocitrate dehydrogenase [NADP] cytoplasmic [R132C]
Ligand
BDBM280025
Substrate
Meas. Tech.
In Vitro Assays for IDH1m (R132H or R132C) Inhibitors
pH
6.5±n/a
Temperature
298.15±n/a K
IC50
<50±n/a nM
Comments
extracted
Citation
 Konteatis, ZDPopovici-Muller, JTravins, JMZahler, RCai, ZZhou, D Therapeutically active compounds and their methods of use US Patent  US10028961 Publication Date 7/24/2018 
Target
Name:
Isocitrate dehydrogenase [NADP] cytoplasmic [R132C]
Synonyms:
IDH1 IDH1(R132C) Isocitrate dehydrogenase (IDH1)(R132C) Isocitrate dehydrogenase [NADP] cytoplasmic (IDH1) (R132C) | PICD
Type:
Enzyme Catalytic Domain
Mol. Mass.:
46607.23
Organism:
Homo sapiens (Human)
Description:
O75874[R132C]
Residue:
414
  
Inhibitor
Name:
BDBM280025
Synonyms:
US10028961, Compound 178 US10946023, Compound 178
Type:
Small organic molecule
Emp. Form.:
C20H15F8N7
Mol. Mass.:
505.3672
SMILES:
FC(F)(F)c1cccc(n1)-c1nc(NC2CCC(F)(F)C2)nc(Nc2ccnc(c2)C(F)(F)F)n1
: