Target
Isocitrate dehydrogenase [NADP] cytoplasmic [R132H]
Ligand
BDBM280105
Substrate
Meas. Tech.
In Vitro Assays for IDH1m (R132H or R132C) Inhibitors
pH
6.5±n/a
Temperature
298.15±n/a K
IC50
550±n/a nM
Comments
extracted
Citation
 Konteatis, ZDPopovici-Muller, JTravins, JMZahler, RCai, ZZhou, D Therapeutically active compounds and their methods of use US Patent  US10028961 Publication Date 7/24/2018 
Target
Name:
Isocitrate dehydrogenase [NADP] cytoplasmic [R132H]
Synonyms:
Cytosolic NADP-isocitrate dehydrogenase (IDH1)(R132H) IDH1 R132H IDHC_HUMAN Isocitrate dehydrogenase 1 mutant (R132H) Isocitrate dehydrogenase [NADP] cytoplasmic (IDH1)(R132H) PICD
Type:
Protein
Mol. Mass.:
46641.74
Organism:
Homo sapiens (Human)
Description:
Human IDH1 R132H (SEQ ID No. 2 in patent). First three are removed. Google patent parsed wrong.
Residue:
414
  
Inhibitor
Name:
BDBM280105
Synonyms:
US10028961, Compound 258 US10946023, Compound 258
Type:
Small organic molecule
Emp. Form.:
C21H24F4N6
Mol. Mass.:
436.4491
SMILES:
FC1(F)CCC(C1)Nc1nc(NC2CCC(F)(F)C2)nc(n1)-c1cccc(n1)C1CC1
: