Target
Isocitrate dehydrogenase [NADP] cytoplasmic [R132C]
Ligand
BDBM280114
Substrate
Meas. Tech.
In Vitro Assays for IDH1m (R132H or R132C) Inhibitors
pH
6.5±n/a
Temperature
298.15±n/a K
IC50
550±n/a nM
Comments
extracted
Citation
 Konteatis, ZDPopovici-Muller, JTravins, JMZahler, RCai, ZZhou, D Therapeutically active compounds and their methods of use US Patent  US10028961 Publication Date 7/24/2018 
Target
Name:
Isocitrate dehydrogenase [NADP] cytoplasmic [R132C]
Synonyms:
IDH1 IDH1(R132C) Isocitrate dehydrogenase (IDH1)(R132C) Isocitrate dehydrogenase [NADP] cytoplasmic (IDH1) (R132C) | PICD
Type:
Enzyme Catalytic Domain
Mol. Mass.:
46607.23
Organism:
Homo sapiens (Human)
Description:
O75874[R132C]
Residue:
414
  
Inhibitor
Name:
BDBM280114
Synonyms:
US10028961, Compound 267 US10946023, Compound 267
Type:
Small organic molecule
Emp. Form.:
C21H19F5N8
Mol. Mass.:
478.4212
SMILES:
CC(C)(CNc1nc(Nc2ccnc(c2)C(C)(F)F)nc(n1)-c1cccc(n1)C(F)(F)F)C#N
: