Target
Isocitrate dehydrogenase [NADP] cytoplasmic [R132C]
Ligand
BDBM280115
Substrate
Meas. Tech.
In Vitro Assays for IDH1m (R132H or R132C) Inhibitors
pH
6.5±n/a
Temperature
298.15±n/a K
IC50
<50±n/a nM
Comments
extracted
Citation
 Konteatis, ZDPopovici-Muller, JTravins, JMZahler, RCai, ZZhou, D Therapeutically active compounds and their methods of use US Patent  US10028961 Publication Date 7/24/2018 
Target
Name:
Isocitrate dehydrogenase [NADP] cytoplasmic [R132C]
Synonyms:
IDH1 IDH1(R132C) Isocitrate dehydrogenase (IDH1)(R132C) Isocitrate dehydrogenase [NADP] cytoplasmic (IDH1) (R132C) | PICD
Type:
Enzyme Catalytic Domain
Mol. Mass.:
46607.23
Organism:
Homo sapiens (Human)
Description:
O75874[R132C]
Residue:
414
  
Inhibitor
Name:
BDBM280115
Synonyms:
US10028961, Compound 268 US10946023, Compound 268
Type:
Small organic molecule
Emp. Form.:
C18H22F3N7
Mol. Mass.:
393.4094
SMILES:
C[C@@H](Nc1nc(N[C@H](C)C2CC2)nc(n1)-c1nccc(n1)C(F)(F)F)C1CC1
: