Target
Isocitrate dehydrogenase [NADP] cytoplasmic [R132C]
Ligand
BDBM280144
Substrate
Meas. Tech.
In Vitro Assays for IDH1m (R132H or R132C) Inhibitors
pH
6.5±n/a
Temperature
298.15±n/a K
IC50
550±n/a nM
Comments
extracted
Citation
 Konteatis, ZDPopovici-Muller, JTravins, JMZahler, RCai, ZZhou, D Therapeutically active compounds and their methods of use US Patent  US10028961 Publication Date 7/24/2018 
Target
Name:
Isocitrate dehydrogenase [NADP] cytoplasmic [R132C]
Synonyms:
IDH1 IDH1(R132C) Isocitrate dehydrogenase (IDH1)(R132C) Isocitrate dehydrogenase [NADP] cytoplasmic (IDH1) (R132C) | PICD
Type:
Enzyme Catalytic Domain
Mol. Mass.:
46607.23
Organism:
Homo sapiens (Human)
Description:
O75874[R132C]
Residue:
414
  
Inhibitor
Name:
BDBM280144
Synonyms:
US10028961, Compound 297 US10946023, Compound 297
Type:
Small organic molecule
Emp. Form.:
C19H22F7N7
Mol. Mass.:
481.4137
SMILES:
FC(F)(F)c1n[nH]cc1-c1nc(NC2CCC(F)(F)CC2)nc(NC2CCC(F)(F)CC2)n1
: