Target
Isocitrate dehydrogenase [NADP], mitochondrial [R140Q]
Ligand
BDBM280228
Substrate
Meas. Tech.
In Vitro Assays for IDH2m R140Q Inhibitors
pH
7.5±n/a
Temperature
298.15±n/a K
IC50
<50±n/a nM
Comments
extracted
Citation
 Konteatis, ZDPopovici-Muller, JTravins, JMZahler, RCai, ZZhou, D Therapeutically active compounds and their methods of use US Patent  US10028961 Publication Date 7/24/2018 
Target
Name:
Isocitrate dehydrogenase [NADP], mitochondrial [R140Q]
Synonyms:
IDH2 IDHP_HUMAN | idh2 r140q
Type:
Enzyme Catalytic Domain
Mol. Mass.:
50823.17
Organism:
Homo sapiens (Human)
Description:
P48735 (R140Q)
Residue:
452
  
Inhibitor
Name:
BDBM280228
Synonyms:
US10028961, Compound 386 US10946023, Compound 386
Type:
Small organic molecule
Emp. Form.:
C14H12F9N7
Mol. Mass.:
449.2776
SMILES:
C[C@@H](Nc1nc(N[C@H](C)C(F)(F)F)nc(n1)-c1cncc(n1)C(F)(F)F)C(F)(F)F
: