Target
Isocitrate dehydrogenase [NADP], mitochondrial [R140Q]
Ligand
BDBM280102
Substrate
Meas. Tech.
In Vitro Assays for IDH2m R140Q Inhibitors
pH
7.5±n/a
Temperature
298.15±n/a K
IC50
550±n/a nM
Comments
extracted
Citation
 Konteatis, ZDPopovici-Muller, JTravins, JMZahler, RCai, ZZhou, D Therapeutically active compounds and their methods of use US Patent  US10028961 Publication Date 7/24/2018 
Target
Name:
Isocitrate dehydrogenase [NADP], mitochondrial [R140Q]
Synonyms:
IDH2 IDHP_HUMAN | idh2 r140q
Type:
Enzyme Catalytic Domain
Mol. Mass.:
50823.17
Organism:
Homo sapiens (Human)
Description:
P48735 (R140Q)
Residue:
452
  
Inhibitor
Name:
BDBM280102
Synonyms:
US10028961, Compound 255 US10946023, Compound 255
Type:
Small organic molecule
Emp. Form.:
C20H23F5N6O
Mol. Mass.:
458.4282
SMILES:
FC(F)(F)c1cccc(n1)-c1nc(NC2CCOCC2)nc(NC2CCC(F)(F)CC2)n1
: