Target
Tyrosine-protein kinase Lck
Ligand
BDBM1773
Substrate
Meas. Tech.
In Vitro Inhibition Assay
pH
7.4±0
Ki
97±0 nM
Citation
 Honigberg, LVerner, EPan, Z Inhibitors of Bruton's tyrosine kinase US Patent  US8476284 Publication Date 7/2/2013 
Target
Name:
Tyrosine-protein kinase Lck
Synonyms:
2.7.10.2 LCK_HUMAN Leukocyte C-terminal Src kinase Lymphocyte-specific protein tyrosine kinase Protein YT16 Proto-oncogene tyrosine-protein kinase LCK T cell-specific protein-tyrosine kinase
Type:
Mol. Mass.:
57987.83
Organism:
Homo sapiens (Human)
Description:
P06239
Residue:
509
  
Inhibitor
Name:
BDBM1773
Synonyms:
US10280174, Comparative Compound 1 US8497277, 13 US9133201, 13 US9133201, 4 | US9975882, comparative compound A
Type:
Emp. Form.:
C25H24N6O2
Mol. Mass.:
440.4971
SMILES:
Nc1ncnc2n(nc(-c3ccc(Oc4ccccc4)cc3)c12)C1CCCN(C1)C(=O)C=C
: