Target
Macrophage colony-stimulating factor 1
Ligand
BDBM97733
Substrate
Meas. Tech.
Fluorescence Polarization Competition Immunoassay
pH
7.5±0
IC50
1±n/a nM
Citation
 Illig, CRBallentine, SKChen, JDesJarlais, RLMeegalla, SKWall, MWilson, K Inhibitors of c-fms kinase US Patent  US8481564 Publication Date 7/9/2013 
Target
Name:
Macrophage colony-stimulating factor 1
Synonyms:
CSF1_MOUSE Csfm | Macrophage colony-stimulating factor 1 (CSF-1)
Type:
Protein
Mol. Mass.:
60631.84
Organism:
Mus musculus (Mouse)
Description:
P07141
Residue:
552
  
Inhibitor
Name:
BDBM97733
Synonyms:
US8481564, 9
Type:
Small organic molecule
Emp. Form.:
C24H28N6O2
Mol. Mass.:
432.5181
SMILES:
CN1CC(CN(C)C1=O)c1ccc(NC(=O)c2nc(c[nH]2)C#N)c(c1)C1=CCCCCC1
: