Target
Tyrosine-protein kinase Yes
Ligand
BDBM97983
Substrate
Meas. Tech.
Luciferase-Based Assay
Temperature
298.15±n/a K
IC50
2.6±0.0 nM
Comments
extracted
Citation
 Gong, XBarrett, KCao, JGritzen, CNoronha, GHood, JDMak, CCMcPherson, APathak, VPRenick, JSoll, RMSplittgerber, UWrasidlo, WZeng, BZhao, NDneprovskaia, E Benzotriazine inhibitors of kinases US Patent  US8481536 Publication Date 7/9/2013 
Target
Name:
Tyrosine-protein kinase Yes
Synonyms:
Proto-oncogene c-Yes YES YES_HUMAN | p61-yes
Type:
Protein
Mol. Mass.:
60801.54
Organism:
Homo sapiens (Human)
Description:
P07947
Residue:
543
  
Inhibitor
Name:
BDBM97983
Synonyms:
US8481536, 578
Type:
Small organic molecule
Emp. Form.:
C27H31N5O
Mol. Mass.:
441.5679
SMILES:
CCN(CC)COc1cccc(Nc2nnc3cc(cc(C)c3n2)-c2c(C)cccc2C)c1
: