Target
Proto-oncogene tyrosine-protein kinase Src
Ligand
BDBM4078
Substrate
Gastrin-based substrate
Meas. Tech.
Src Inhibition Assay
pH
7.4±n/a
Temperature
303.15±n/a K
IC50
300±n/a nM
Citation
 Dow, RLChou, TTBechle, BMGoddard, CLarson, ER Identification of tricyclic analogs related to ellagic acid as potent/selective tyrosine protein kinase inhibitors. J Med Chem 37:2224-31 (1994)  
Target
Name:
Proto-oncogene tyrosine-protein kinase Src
Synonyms:
Calmodulin/Proto-oncogene tyrosine-protein kinase Src Proto-oncogene c-Src SRC SRC_HUMAN V-src sarcoma (Schmidt-Ruppin A-2) viral oncogene homolog (avian) p60-Src | pp60c-src
Type:
Protein
Mol. Mass.:
59838.60
Organism:
Homo sapiens (Human)
Description:
P12931
Residue:
536
  
Inhibitor
Name:
BDBM4078
Synonyms:
6,7,13,14-tetrahydroxy-2,9-dioxatetracyclo[6.6.2.0^{4,16}.0^{11,15}]hexadeca-1(14),4(16),5,7,11(15),12-hexaene-3,10-dione ELLAGIC ACID Ellagic acid (18) MLS000069632 cid_5281855
Type:
Small organic molecule
Emp. Form.:
C14H6O8
Mol. Mass.:
302.1926
SMILES:
Oc1cc2c3c(oc(=O)c4cc(O)c(O)c(oc2=O)c34)c1O
:
Substrate
Name:
Gastrin-based substrate
Synonyms:
Type:
Peptide
Mol. Mass.:
2351.54
Organism:
Description:
50 uM ATP as co-substrate.
Residue:
19
KKKGPWLEEEEEAYGWLDF