Target
High affinity nerve growth factor receptor
Ligand
BDBM98016
Substrate
Meas. Tech.
Amplified Luminescent Proximity Assay
Temperature
298.15±n/a K
IC50
3±n/a nM
Comments
extracted
Citation
 Davies, AIoannidis, SLamb, MSu, MWang, TZhang, H 9-(pyrazol-3-yl)-9H-purine-2-amine and 3-(pyrazol-3-yl) -3H-imidazo[4,5-B] pyridin-5-amine derivatives and their use for the treatment of cancer US Patent  US8486966 Publication Date 7/16/2013 
Target
Name:
High affinity nerve growth factor receptor
Synonyms:
2.7.10.1 NTRK1 NTRK1_HUMAN Neurotrophic tyrosine kinase receptor type 1 Synonyms=MTC TRK1-transforming tyrosine kinase protein TRKA GN Tropomyosin alpha-3 chain/High affinity nerve growth factor receptor Tropomyosin-related kinase A (TrkA) Tyrosine kinase receptor (Trk) Tyrosine kinase receptor A (Trk A) Tyrosine kinase receptor A (TrkA) p140-TrkA
Type:
Mol. Mass.:
87498.18
Organism:
Homo sapiens (Human)
Description:
P04629
Residue:
796
  
Inhibitor
Name:
BDBM98016
Synonyms:
US8486966, 10
Type:
Small organic molecule
Emp. Form.:
C18H18FN7O
Mol. Mass.:
367.3802
SMILES:
CCOc1cc(n[nH]1)-n1cnc2ccc(N[C@@H](C)c3ccc(F)cn3)nc12
: