Target
Serine/threonine-protein kinase pim-2
Ligand
BDBM50299249
Substrate
Meas. Tech.
Inhibition Assay
IC50
5.1e+2±n/a nM
Citation
 Anizon, FMoreau, PPrudhomme, MCohen, PAboab, BAkue-Gedu, RRossignol, E Pyrrolo[2,3-a] carbazoles and use thereof as PIM kinase inhibitors US Patent  US8481586 Publication Date 7/9/2013 
Target
Name:
Serine/threonine-protein kinase pim-2
Synonyms:
PIM2 Pim-2h Serine/threonine-protein kinase PIM | Serine/threonine-protein kinase pim-2 (PIM2)
Type:
Serine/threonine-protein kinase
Mol. Mass.:
34185.93
Organism:
Homo sapiens (Human)
Description:
Q9P1W9
Residue:
311
  
Inhibitor
Name:
BDBM50299249
Synonyms:
1,10-Dihydropyrrolo[2,3-a]carbazole-3-carbaldehyde US8481586, 3
Type:
Small organic molecule
Emp. Form.:
C15H10N2O
Mol. Mass.:
234.2527
SMILES:
O=Cc1c[nH]c2c1ccc1c3ccccc3[nH]c21
: