Target
Dipeptidyl peptidase 2
Ligand
BDBM50135054
Substrate
Dipeptidyl peptidase II and dipeptidyl peptidase IV (DPP2 and DPP4)
Meas. Tech.
DPP IV Assay
pH
5.5±0
Temperature
273.15±0 K
IC50
3800±100 nM
Citation
 Senten, KDaniëls, LVan der Veken, PDe Meester, ILambeir, AMScharpé, SHaemers, AAugustyns, K Rapid parallel synthesis of dipeptide diphenyl phosphonate esters as inhibitors of dipeptidyl peptidases. J Comb Chem 5:336-44 (2003)  
Target
Name:
Dipeptidyl peptidase 2
Synonyms:
DAP II DPP2_HUMAN Dipeptidyl aminopeptidase II Dipeptidyl peptidase 2 (DPP2) Dipeptidyl peptidase II (DPP II) Dipeptidyl peptidase II and dipeptidyl peptidase IV (DPP2 and DPP4) carboxytripeptidase dipeptidyl(amino)peptidase II | dipeptidylarylamidase
Type:
Protein
Mol. Mass.:
54339.29
Organism:
Homo sapiens (Human)
Description:
Q9UHL4
Residue:
492
  
Inhibitor
Name:
BDBM50135054
Synonyms:
CHEMBL344507 [(2-Cyclopentylamino-acetylamino)-phenyl-methyl]-phosphonic acid diphenyl ester
Type:
Small organic molecule
Emp. Form.:
C26H29N2O4P
Mol. Mass.:
464.4932
SMILES:
O=C(CNC1CCCC1)NC(c1ccccc1)P(=O)(Oc1ccccc1)Oc1ccccc1
:
Substrate
Name:
Dipeptidyl peptidase 2
Synonyms:
DAP II DPP2_HUMAN Dipeptidyl aminopeptidase II Dipeptidyl peptidase 2 (DPP2) Dipeptidyl peptidase II (DPP II) Dipeptidyl peptidase II and dipeptidyl peptidase IV (DPP2 and DPP4) carboxytripeptidase dipeptidyl(amino)peptidase II | dipeptidylarylamidase
Type:
Protein
Mol. Mass.:
54339.29
Organism:
Homo sapiens (Human)
Description:
Q9UHL4
Residue:
492