Target
NH(3)-dependent NAD(+) synthetase
Ligand
BDBM98121
Substrate
Meas. Tech.
NADs HPLC Enzyme Assay
pH
8.5±0
Temperature
277.15±0 K
IC50
>600000±0.0 nM
Citation
 Moro, WBYang, ZKane, TAZhou, QHarville, SBrouillette, CGBrouillette, WJ SAR studies for a new class of antibacterial NAD biosynthesis inhibitors. J Comb Chem 11:617-25 (2009)  
Target
Name:
NH(3)-dependent NAD(+) synthetase
Synonyms:
BAS1855 GBAA_1998 Nicotinamide adenine dinucleotide synthetase (NADs) | nadE
Type:
Enzyme
Mol. Mass.:
30092.16
Organism:
Bacillus anthracis
Description:
Q81RP3
Residue:
272
  
Inhibitor
Name:
BDBM98121
Synonyms:
1-[4-[(4-chlorophenyl)sulfonylamino]phenyl]-3-(2-nitrophenyl)urea | Compound ID 7{3,10}
Type:
Small organic molecule
Emp. Form.:
C19H15ClN4O5S
Mol. Mass.:
446.864
SMILES:
[O-][N+](=O)c1ccccc1NC(=O)Nc1ccc(NS(=O)(=O)c2ccc(Cl)cc2)cc1
: