Target
NH(3)-dependent NAD(+) synthetase
Ligand
BDBM98132
Substrate
Meas. Tech.
NADs HPLC Enzyme Assay
pH
8.5±0
Temperature
277.15±0 K
IC50
362000±0.0 nM
Citation
 Moro, WBYang, ZKane, TAZhou, QHarville, SBrouillette, CGBrouillette, WJ SAR studies for a new class of antibacterial NAD biosynthesis inhibitors. J Comb Chem 11:617-25 (2009)  
Target
Name:
NH(3)-dependent NAD(+) synthetase
Synonyms:
BAS1855 GBAA_1998 Nicotinamide adenine dinucleotide synthetase (NADs) | nadE
Type:
Enzyme
Mol. Mass.:
30092.16
Organism:
Bacillus anthracis
Description:
Q81RP3
Residue:
272
  
Inhibitor
Name:
BDBM98132
Synonyms:
1-(3-nitrophenyl)-3-[4-[(4-phenoxyphenyl)sulfonylamino]phenyl]urea | Compound ID 7{2,14}
Type:
Small organic molecule
Emp. Form.:
C25H20N4O6S
Mol. Mass.:
504.514
SMILES:
[O-][N+](=O)c1cccc(NC(=O)Nc2ccc(NS(=O)(=O)c3ccc(Oc4ccccc4)cc3)cc2)c1
: