Target
Probable nicotinate-nucleotide adenylyltransferase
Ligand
BDBM98115
Substrate
Meas. Tech.
NaMNAT HPLC Enzyme Assay
pH
7.5±0
Temperature
273.15±0 K
IC50
>150000±0.0 nM
Citation
 Moro, WBYang, ZKane, TAZhou, QHarville, SBrouillette, CGBrouillette, WJ SAR studies for a new class of antibacterial NAD biosynthesis inhibitors. J Comb Chem 11:617-25 (2009)  
Target
Name:
Probable nicotinate-nucleotide adenylyltransferase
Synonyms:
BAMEG_4595 Deamido-NAD(+) pyrophosphorylase Nicotinate mononucleotide adenylyltransferase Nicotinate-nucleotide adenylyltransferase (NadD) nadD
Type:
Enzyme
Mol. Mass.:
21955.08
Organism:
Bacillus anthracis
Description:
C3L5T6
Residue:
189
  
Inhibitor
Name:
BDBM98115
Synonyms:
1-[4-[(2-chlorophenyl)sulfonylamino]phenyl]-3-(2-nitrophenyl)urea | Compound ID 7{3,8}
Type:
Small organic molecule
Emp. Form.:
C19H15ClN4O5S
Mol. Mass.:
446.864
SMILES:
[O-][N+](=O)c1ccccc1NC(=O)Nc1ccc(NS(=O)(=O)c2ccccc2Cl)cc1
: