Target
Cytochrome P450 11B2, mitochondrial
Ligand
BDBM280275
Substrate
Meas. Tech.
Inhibitory Effect on hCYP11B2
pH
7.4±n/a
Temperature
298.15±n/a K
IC50
18.0±n/a nM
Comments
extracted
Citation
 Ushirogochi, HSasaki, WOnda, YSakakibara, RAkahoshi, F Disubstituted 1, 2, 4-triazine compound US Patent  US10029993 Publication Date 7/24/2018 
Target
Name:
Cytochrome P450 11B2, mitochondrial
Synonyms:
Aldosterone Synthase (CYP11B2) Aldosterone-synthesizing enzyme CYP11B2 Cytochrome P450 11B2 Cytochrome P450 11B2, mitochondrial P-450C18 | Steroid 18-hydroxylase
Type:
Protein
Mol. Mass.:
57582.15
Organism:
Homo sapiens (Human)
Description:
P19099
Residue:
503
  
Inhibitor
Name:
BDBM280275
Synonyms:
US10029993, Example 29
Type:
Small organic molecule
Emp. Form.:
C24H35N7O
Mol. Mass.:
437.581
SMILES:
CN(C)[C@H]1CC[C@@H](CC1)NC(=O)CN1CCN(CC1)c1nncc(n1)-c1ccccc1C
: