Target
Activated CDC42 kinase 1
Ligand
BDBM98261
Substrate
Meas. Tech.
AlphaScreen Assay
IC50
2527.6±n/a nM
Citation
 Crew, APJin, MKadalbajoo, MKleinberg, AMulvihill, MJWang, J Substituted imidazopyr- and imidazotri-azines US Patent  US8481733 Publication Date 7/9/2013 
Target
Name:
Activated CDC42 kinase 1
Synonyms:
ACK1 Activated CDC42 kinase 1 (ACK-1) Tyrosine kinase non-receptor protein 2
Type:
Protein
Mol. Mass.:
114577.86
Organism:
Homo sapiens (Human)
Description:
Q07912
Residue:
1038
  
Inhibitor
Name:
BDBM98261
Synonyms:
US8481733, 205 US8481733, 73
Type:
Small organic molecule
Emp. Form.:
C23H21FN4O2
Mol. Mass.:
404.4368
SMILES:
COc1cccc(F)c1Oc1ccc(cc1)-c1nc(C2CCC2)n2ccnc(N)c12
: