Target
Urokinase plasminogen activator surface receptor
Ligand
BDBM98583
Substrate
Meas. Tech.
Enzyme Assay
Temperature
297.15±0 K
Ki
38±0.0 nM
Citation
 Stuerzebecher, JSteinmetzer, TSchweinitz, A Urokinase inhibitors, production and use thereof US Patent  US8476306 Publication Date 7/2/2013 
Target
Name:
Urokinase plasminogen activator surface receptor
Synonyms:
CD87 Plaur UPAR URKR
Type:
Protein
Mol. Mass.:
35754.96
Organism:
Rattus norvegicus
Description:
P49616
Residue:
328
  
Inhibitor
Name:
BDBM98583
Synonyms:
4-[[(1R)-2-[[(1S)-2-[(4-carbamimidoylphenyl)methylamino]-1-methyl-2-oxo-ethyl]amino]-1-(hydroxymethyl)-2-oxo-ethyl]sulfamoylmethyl]benzoic acid | US8476306, 6.8
Type:
Small organic molecule
Emp. Form.:
C22H27N5O7S
Mol. Mass.:
505.544
SMILES:
C[C@H](NC(=O)[C@@H](CO)NS(=O)(=O)Cc1ccc(cc1)C(O)=O)C(=O)NCc1ccc(cc1)C(N)=N
: