Target
Urokinase plasminogen activator surface receptor
Ligand
BDBM98599
Substrate
Meas. Tech.
Enzyme Assay
Temperature
297.15±0 K
Ki
24±0.0 nM
Citation
 Stuerzebecher, JSteinmetzer, TSchweinitz, A Urokinase inhibitors, production and use thereof US Patent  US8476306 Publication Date 7/2/2013 
Target
Name:
Urokinase plasminogen activator surface receptor
Synonyms:
CD87 Plaur UPAR URKR
Type:
Protein
Mol. Mass.:
35754.96
Organism:
Rattus norvegicus
Description:
P49616
Residue:
328
  
Inhibitor
Name:
BDBM98599
Synonyms:
(2S)-6-amino-2-[[(2R)-2-(benzylsulfonylamino)-3-hydroxy-propanoyl]amino]-N-[(4-carbamimidoylphenyl)methyl]hexanamide | US8476306, 8.1
Type:
Small organic molecule
Emp. Form.:
C24H34N6O5S
Mol. Mass.:
518.629
SMILES:
NCCCC[C@H](NC(=O)[C@@H](CO)NS(=O)(=O)Cc1ccccc1)C(=O)NCc1ccc(cc1)C(N)=N
: