Target
Plasminogen
Ligand
BDBM98578
Substrate
Meas. Tech.
Enzyme Assay
Temperature
297.15±0 K
Ki
59000±0.0 nM
Citation
 Stuerzebecher, JSteinmetzer, TSchweinitz, A Urokinase inhibitors, production and use thereof US Patent  US8476306 Publication Date 7/2/2013 
Target
Name:
Plasminogen
Synonyms:
PLMN_RAT Plasminogen | Plg
Type:
Protein
Mol. Mass.:
90541.87
Organism:
Rattus norvegicus
Description:
Q01177
Residue:
812
  
Inhibitor
Name:
BDBM98578
Synonyms:
3-[[(1R)-2-[[2-[(4-carbamimidoylphenyl)methylamino]-2-oxo-ethyl]amino]-1-(hydroxymethyl)-2-oxo-ethyl]sulfamoylmethyl]benzoic acid | US8476306, 6.3
Type:
Small organic molecule
Emp. Form.:
C21H25N5O7S
Mol. Mass.:
491.518
SMILES:
NC(=N)c1ccc(CNC(=O)CNC(=O)[C@@H](CO)NS(=O)(=O)Cc2cccc(c2)C(O)=O)cc1
: