Target
Prothrombin
Ligand
BDBM98603
Substrate
Meas. Tech.
Enzyme Assay
Temperature
297.15±0 K
Ki
8500±0.0 nM
Citation
 Stuerzebecher, JSteinmetzer, TSchweinitz, A Urokinase inhibitors, production and use thereof US Patent  US8476306 Publication Date 7/2/2013 
Target
Name:
Prothrombin
Synonyms:
Activated blood-coagulation factor II Activation peptide fragment 2 Blood-coagulation factor IIa E thrombin Factor IIa Gamma-thrombin THRB_RAT Thrombin Thrombin light chain Thrombofort | Tropostasin
Type:
Protein
Mol. Mass.:
70413.05
Organism:
Rattus norvegicus
Description:
P18292
Residue:
617
  
Inhibitor
Name:
BDBM98603
Synonyms:
3-amino-N-[4-[[(2S)-2-[[(2R)-2-(benzylsulfonylamino)-3-hydroxy-propanoyl]amino]-3-(1H-imidazol-5-yl)propanoyl]amino]phenyl]-4-methoxy-benzamide | US8476306, 12
Type:
Small organic molecule
Emp. Form.:
C24H29N7O5S
Mol. Mass.:
527.596
SMILES:
NC(=N)c1ccc(CNC(=O)[C@H](Cc2cnc[nH]2)NC(=O)[C@H](CO)NS(=O)(=O)Cc2ccccc2)cc1
: