Target
Serine protease 1
Ligand
BDBM98589
Substrate
Meas. Tech.
Enzyme Assay
Temperature
297.15±0 K
Ki
30±0.0 nM
Citation
 Stuerzebecher, JSteinmetzer, TSchweinitz, A Urokinase inhibitors, production and use thereof US Patent  US8476306 Publication Date 7/2/2013 
Target
Name:
Serine protease 1
Synonyms:
PTRYI RATPTRYI Trp1 Tryp1 | Trypsin
Type:
Protein
Mol. Mass.:
25951.67
Organism:
Rattus norvegicus
Description:
P00762
Residue:
246
  
Inhibitor
Name:
BDBM98589
Synonyms:
(2S)-2-[[(2R)-2-(benzylsulfonylamino)-3-hydroxy-propanoyl]amino]-N-[(4-carbamimidoylphenyl)methyl]-3-hydroxy-butanamide | US8476306, 6.15
Type:
Small organic molecule
Emp. Form.:
C22H29N5O6S
Mol. Mass.:
491.561
SMILES:
CC(O)[C@H](NC(=O)[C@@H](CO)NS(=O)(=O)Cc1ccccc1)C(=O)NCc1ccc(cc1)C(N)=N
: