Target
Serine protease 1
Ligand
BDBM98596
Substrate
Meas. Tech.
Enzyme Assay
Temperature
297.15±0 K
Ki
110±0.0 nM
Citation
 Stuerzebecher, JSteinmetzer, TSchweinitz, A Urokinase inhibitors, production and use thereof US Patent  US8476306 Publication Date 7/2/2013 
Target
Name:
Serine protease 1
Synonyms:
PTRYI RATPTRYI Trp1 Tryp1 | Trypsin
Type:
Protein
Mol. Mass.:
25951.67
Organism:
Rattus norvegicus
Description:
P00762
Residue:
246
  
Inhibitor
Name:
BDBM98596
Synonyms:
(2R)-N-[2-[(4-carbamimidoylphenyl)methylamino]-2-oxo-ethyl]-2-[(4-fluorophenyl)methylsulfonylamino]-3-hydroxy-propanamide | US8476306, 6.22
Type:
Small organic molecule
Emp. Form.:
C20H24FN5O5S
Mol. Mass.:
465.498
SMILES:
NC(=N)c1ccc(CNC(=O)CNC(=O)[C@@H](CO)NS(=O)(=O)Cc2ccc(F)cc2)cc1
: