Target
Vascular endothelial growth factor receptor 3
Ligand
BDBM98613
Substrate
Meas. Tech.
ELISA Assay
Temperature
293.15±0 K
IC50
65±0.0 nM
Citation
 Alam, ABiscarrat, SBlanc, IBono, FDuclos, OMccort, G Derivatives of 7-alkynyl-1,8-Naphthyridones, Preparation Method Therefore and Use of Same in Therapeutics US Patent  US8470847 Publication Date 6/25/2013 
Target
Name:
Vascular endothelial growth factor receptor 3
Synonyms:
FLT-4 Fms-like tyrosine kinase 4 VEGFR-3 VGFR3_HUMAN Vascular endothelial growth factor receptor 3 (VEGFR-3) | Vascular endothelial growth factor receptor 3 (VEGFR3)
Type:
Protein
Mol. Mass.:
152749.58
Organism:
Homo sapiens (Human)
Description:
P35916-2
Residue:
1363
  
Inhibitor
Name:
BDBM98613
Synonyms:
2-amino-7-(3-hydroxy-4-methoxy-3-methyl-but-1-ynyl)-N-methyl-4-oxo-1-(2-pyridylmethyl)-1,8-naphthyridine-3-carboxamide | US8470847, 47
Type:
Small organic molecule
Emp. Form.:
C22H23N5O4
Mol. Mass.:
421.4491
SMILES:
CNC(=O)c1c(N)n(Cc2ccccn2)c2nc(ccc2c1=O)C#CC(C)(O)COC
: