Target
Activin receptor type-1
Ligand
BDBM280352
Substrate
Meas. Tech.
In Vitro Kinase Assay Inhibition of ALK1/2/3/4/5/6 Kinases
IC50
>1000000±n/a nM
Citation
 Rai, RChakravarty, SPujala, BShinde, BUNayak, AKChaklan, NAgarwal, AKRamachandran, SAPham, SM Compounds and methods of use US Patent  US10030004 Publication Date 7/24/2018 
Target
Name:
Activin receptor type-1
Synonyms:
2.7.11.30 ACVR1 ACVRLK2 ALK2/ACVR1 Activin receptor-like kinase 2 Activin receptor-like kinase 2 (ALK2/ACVR1) SKR1 TGF-B superfamily receptor type I | TSR-I
Type:
Mol. Mass.:
57158.32
Organism:
Homo sapiens (Human)
Description:
Residue:
509
  
Inhibitor
Name:
BDBM280352
Synonyms:
N-(2-aminoethyl)-4-[[2-(5-chloro-2-fluoro-phenyl)-5-isopropyl-4-pyridyl]amino]pyridine-3-carboxamide US10501436, Compound 19 | US11702401, Compound 19
Type:
Small organic molecule
Emp. Form.:
C27H31ClFN5O3
Mol. Mass.:
528.018
SMILES:
CC(C)c1cnc(cc1Nc1ccncc1C(=O)NCCNC(=O)OC(C)(C)C)-c1cc(Cl)ccc1F
: