Target
Activin receptor type-1B
Ligand
BDBM280360
Substrate
Meas. Tech.
In Vitro Kinase Assay Inhibition of ALK1/2/3/4/5/6 Kinases
IC50
11.5±n/a nM
Citation
 Rai, RChakravarty, SPujala, BShinde, BUNayak, AKChaklan, NAgarwal, AKRamachandran, SAPham, SM Compounds and methods of use US Patent  US10030004 Publication Date 7/24/2018 
Target
Name:
Activin receptor type-1B
Synonyms:
ACV1B_HUMAN ACVRLK4 Activin receptor type-1B/Activin receptor-like kinase 4 (ALK-4)
Type:
PROTEIN
Mol. Mass.:
56810.99
Organism:
Homo sapiens (Human)
Description:
ChEMBL_587064
Residue:
505
  
Inhibitor
Name:
BDBM280360
Synonyms:
4-[[2-(5-chloro-2-fluoro-phenyl)-5-isopropenyl-4-pyridyl]amino]-N-(2-hydroxy ethyl)pyridine-3-carboxamide US10501436, Compound 26 US11702401, Compound 26
Type:
Small organic molecule
Emp. Form.:
C22H20ClFN4O2
Mol. Mass.:
426.871
SMILES:
CC(=C)c1cnc(cc1Nc1ccncc1C(=O)NCCO)-c1cc(Cl)ccc1F
: