Target
TGF-beta receptor type-1
Ligand
BDBM280363
Substrate
Meas. Tech.
In Vitro Kinase Assay Inhibition of ALK1/2/3/4/5/6 Kinases
IC50
16.4±n/a nM
Citation
 Rai, RChakravarty, SPujala, BShinde, BUNayak, AKChaklan, NAgarwal, AKRamachandran, SAPham, SM Compounds and methods of use US Patent  US10030004 Publication Date 7/24/2018 
Target
Name:
TGF-beta receptor type-1
Synonyms:
ALK-5 Activin A receptor type II-like protein kinase of 53kD SKR4 TGF-beta receptor type I TGFBR1 TGFR1_HUMAN Transforming growth factor-beta receptor type I
Type:
enzyme
Mol. Mass.:
55968.24
Organism:
Homo sapiens (Human)
Description:
P36897
Residue:
503
  
Inhibitor
Name:
BDBM280363
Synonyms:
2-(3-fluoropyridin-2-yl)-5-(propan-2-yl)-N-{1H-pyrrolo[2,3-b]pyridin-4-yl}pyridin-4-amine US10501436, Compound 29 US11702401, Compound 29
Type:
Small organic molecule
Emp. Form.:
C20H18FN5
Mol. Mass.:
347.3888
SMILES:
CC(C)c1cnc(cc1Nc1ccnc2[nH]ccc12)-c1ncccc1F
: