Target
Gag-Pol polyprotein
Ligand
BDBM98665
Substrate
Meas. Tech.
Inhibition Assay
IC50
9.5e+2±n/a nM
Citation
 Thuring, JWBonfanti, JFortin, JM Macrocyclic integrase inhibitors US Patent  US8497270 Publication Date 7/30/2013 
Target
Name:
Gag-Pol polyprotein
Synonyms:
Gag-Pol polyprotein Protease | gag-pol
Type:
Protein
Mol. Mass.:
163312.58
Organism:
Human immunodeficiency virus type 1 (HIV-1)
Description:
P03367
Residue:
1447
  
Inhibitor
Name:
BDBM98665
Synonyms:
US8497270, 24
Type:
Small organic molecule
Emp. Form.:
C17H13BrN2O3
Mol. Mass.:
373.201
SMILES:
COC(=O)c1nc(Br)c2cccnc2c1OCc1ccccc1
: