Target
Beta-lactamase
Ligand
BDBM98814
Substrate
BDBM98856
Meas. Tech.
Spectrophotometric Assay
IC50
20±0.0 nM
Citation
 Blizzard, TAChen, HGude, CHermes, JDImbriglio, JKim, SWu, JYMortko, CJMangion, IRivera, NRuck, RTShevlin, M Beta-lactamase inhibitors US Patent  US8487093 Publication Date 7/16/2013 
Target
Name:
Beta-lactamase
Synonyms:
Beta-lactamase (KPC-2)
Type:
Enzyme
Mol. Mass.:
27537.23
Organism:
Klebsiella pneumoniae
Description:
I7AKP2
Residue:
260
  
Inhibitor
Name:
BDBM98814
Synonyms:
US8487093, 206
Type:
Small organic molecule
Emp. Form.:
C15H21N7O6S
Mol. Mass.:
427.436
SMILES:
OS(=O)(=O)ON1[C@H]2CN([C@@H](CC2)C(=O)Nc2ccnc(n2)N2CCNCC2)C1=O
:
Substrate
Name:
BDBM98856
Synonyms:
US8487093, Substrate
Type:
Small organic molecule
Emp. Form.:
C21H16N4O8S2
Mol. Mass.:
516.504
SMILES:
OC(=O)C1=C(CSC2C(NC(=O)Cc3cccs3)C(=O)N12)\C=C\c1ccc(cc1N(=O)=O)N(=O)=O
: