Target
Beta-lactamase
Ligand
BDBM98789
Substrate
BDBM98856
Meas. Tech.
Spectrophotometric Assay
IC50
7±0.0 nM
Citation
 Blizzard, TAChen, HGude, CHermes, JDImbriglio, JKim, SWu, JYMortko, CJMangion, IRivera, NRuck, RTShevlin, M Beta-lactamase inhibitors US Patent  US8487093 Publication Date 7/16/2013 
Target
Name:
Beta-lactamase
Synonyms:
Beta-lactamase (AmpC)
Type:
Enzyme
Mol. Mass.:
43489.98
Organism:
Pseudomonas aeruginosa
Description:
Q3LG62
Residue:
397
  
Inhibitor
Name:
BDBM98789
Synonyms:
US8487093, 174
Type:
Small organic molecule
Emp. Form.:
C13H16N4O8S2
Mol. Mass.:
420.418
SMILES:
NS(=O)(=O)c1ccc(NC(=O)[C@@H]2CC[C@@H]3CN2C(=O)N3OS(O)(=O)=O)cc1
:
Substrate
Name:
BDBM98856
Synonyms:
US8487093, Substrate
Type:
Small organic molecule
Emp. Form.:
C21H16N4O8S2
Mol. Mass.:
516.504
SMILES:
OC(=O)C1=C(CSC2C(NC(=O)Cc3cccs3)C(=O)N12)\C=C\c1ccc(cc1N(=O)=O)N(=O)=O
: