Target
Adenosine receptor A1
Ligand
BDBM99209
Substrate
Meas. Tech.
Binding Assay
Ki
5.59±0.0 nM
Citation
 Jagtap, P Adenosine compounds and their use thereof US Patent  US8501708 Publication Date 8/6/2013 
Target
Name:
Adenosine receptor A1
Synonyms:
AA1R_RABIT ADENOSINE A1 high ADORA1 | Adenosine receptor A1 (A1)
Type:
Enzyme
Mol. Mass.:
36566.33
Organism:
Oryctolagus cuniculus (Rabbit)
Description:
P34970
Residue:
328
  
Inhibitor
Name:
BDBM99209
Synonyms:
US8501708, 33
Type:
Small organic molecule
Emp. Form.:
C23H29N5O6
Mol. Mass.:
471.5063
SMILES:
COc1cccc(CO[C@@H]2CCCC2Nc2ncnc3n(cnc23)[C@@H]2O[C@H](CO)[C@@H](O)[C@H]2O)c1
: