Target
Adenosine receptor A3
Ligand
BDBM99197
Substrate
Meas. Tech.
Binding Assay
Ki
1350±0.0 nM
Citation
 Jagtap, P Adenosine compounds and their use thereof US Patent  US8501708 Publication Date 8/6/2013 
Target
Name:
Adenosine receptor A3
Synonyms:
AA3R_RABIT ADORA3
Type:
Protein
Mol. Mass.:
36319.35
Organism:
Oryctolagus cuniculus (rabbit)
Description:
O02667
Residue:
319
  
Inhibitor
Name:
BDBM99197
Synonyms:
US8501708, 17
Type:
Small organic molecule
Emp. Form.:
C23H29N5O5
Mol. Mass.:
455.5069
SMILES:
Cc1ccccc1CO[C@H]1CCCC1Nc1ncnc2n(cnc12)C1O[C@H](CO)[C@@H](O)[C@H]1O
: