Target
11-beta-hydroxysteroid dehydrogenase 1
Ligand
BDBM99419
Substrate
Meas. Tech.
In Vitro Inhibition Assay
pH
6±0
Temperature
310.15±0 K
IC50
1137±0.0 nM
Citation
 Eckhardt, MPeters, SNar, HHimmelsbach, FZhuang, L Aryl- and heteroarylcarbonyl derivatives of hexahydroindenopyridine and octahydrobenzoquinoline US Patent  US8497281 Publication Date 7/30/2013 
Target
Name:
11-beta-hydroxysteroid dehydrogenase 1
Synonyms:
11-DH 11-beta-Hydroxysteroid Dehydrogenase 1 (11-beta-HSD1) 11-beta-hydroxysteroid dehydrogenase 1 (11HSD1) Corticosteroid 11-beta-dehydrogenase isozyme 1 (11-beta-HSD-1) Corticosteroid 11-beta-dehydrogenase isozyme 1 (11beta-HSD1) HSD11 HSD11L | SDR26C1
Type:
Enzyme
Mol. Mass.:
32409.16
Organism:
Homo sapiens (Human)
Description:
P28845
Residue:
292
  
Inhibitor
Name:
BDBM99419
Synonyms:
US8497281, 197 US9663470, 130
Type:
Small organic molecule
Emp. Form.:
C19H19FN2O
Mol. Mass.:
310.3654
SMILES:
Nc1cc(ccc1F)C(=O)N1CCCC2[C@@H]1Cc1ccccc21
: