Target
1-phosphatidylinositol 4,5-bisphosphate phosphodiesterase gamma-1
Ligand
BDBM87754
Substrate
Meas. Tech.
ITK Target Modulation PLC-gamma Assay
Temperature
310.15±n/a K
IC50
3000±n/a nM
Comments
extracted
Citation
 Jacobsen, EJBlinn, JRSpringer, JRHockerman, SL Heterocyclic ITK inhibitors for treating inflammation and cancer US Patent  US9695200 Publication Date 7/4/2017 
Target
Name:
1-phosphatidylinositol 4,5-bisphosphate phosphodiesterase gamma-1
Synonyms:
PLC1 PLCG1_HUMAN | Phospholipase C-gamma-1
Type:
PROTEIN
Mol. Mass.:
148518.78
Organism:
Homo sapiens (Human)
Description:
ChEMBL_1435182
Residue:
1290
  
Inhibitor
Name:
BDBM87754
Synonyms:
US9695200, 12
Type:
Small organic molecule
Emp. Form.:
C21H16N4O
Mol. Mass.:
340.3779
SMILES:
C=CC(=O)Nc1cccc(c1)-c1cnc2[nH]cc(-c3cccnc3)c2c1
: