Target
Tyrosine-protein kinase ITK/TSK
Ligand
BDBM98781
Substrate
Meas. Tech.
ITK Inhibitor Binding Kinetics
IC50
>1000±n/a nM
Citation
 Jacobsen, EJBlinn, JRSpringer, JRHockerman, SL Heterocyclic ITK inhibitors for treating inflammation and cancer US Patent  US9695200 Publication Date 7/4/2017 
Target
Name:
Tyrosine-protein kinase ITK/TSK
Synonyms:
EMT ITK_HUMAN LYK Tyrosine-protein kinase ITK Tyrosine-protein kinase Lyk
Type:
Protein
Mol. Mass.:
71839.20
Organism:
Homo sapiens (Human)
Description:
Q08881
Residue:
620
  
Inhibitor
Name:
BDBM98781
Synonyms:
US9695200, 31
Type:
Small organic molecule
Emp. Form.:
C23H17F3N4O2
Mol. Mass.:
438.4019
SMILES:
COc1cc(cc(n1)C(F)(F)F)-c1c[nH]c2ncc(cc12)-c1cccc(NC(=O)C=C)c1
: