Target
Tyrosine-protein kinase ITK/TSK
Ligand
BDBM100840
Substrate
Meas. Tech.
ITK Inhibitor Binding Kinetics
IC50
<1000±n/a nM
Citation
 Jacobsen, EJBlinn, JRSpringer, JRHockerman, SL Heterocyclic ITK inhibitors for treating inflammation and cancer US Patent  US9695200 Publication Date 7/4/2017 
Target
Name:
Tyrosine-protein kinase ITK/TSK
Synonyms:
EMT ITK_HUMAN LYK Tyrosine-protein kinase ITK Tyrosine-protein kinase Lyk
Type:
Protein
Mol. Mass.:
71839.20
Organism:
Homo sapiens (Human)
Description:
Q08881
Residue:
620
  
Inhibitor
Name:
BDBM100840
Synonyms:
US9695200, 64
Type:
Small organic molecule
Emp. Form.:
C25H18N4O
Mol. Mass.:
390.4366
SMILES:
C=CC(=O)Nc1cccc(c1)-c1cnc2[nH]cc(-c3ccnc4ccccc34)c2c1
: