Target
Tyrosine-protein kinase ITK/TSK
Ligand
BDBM108382
Substrate
Meas. Tech.
ITK Inhibitor Binding Kinetics
IC50
<1000±n/a nM
Citation
 Jacobsen, EJBlinn, JRSpringer, JRHockerman, SL Heterocyclic ITK inhibitors for treating inflammation and cancer US Patent  US9695200 Publication Date 7/4/2017 
Target
Name:
Tyrosine-protein kinase ITK/TSK
Synonyms:
EMT ITK_HUMAN LYK Tyrosine-protein kinase ITK Tyrosine-protein kinase Lyk
Type:
Protein
Mol. Mass.:
71839.20
Organism:
Homo sapiens (Human)
Description:
Q08881
Residue:
620
  
Inhibitor
Name:
BDBM108382
Synonyms:
US9695200, 88
Type:
Small organic molecule
Emp. Form.:
C27H23N5O2
Mol. Mass.:
449.5038
SMILES:
C=CC(=O)Nc1cccc(c1)-c1cnc2[nH]cc(-c3cn(CC4CC4)c(=O)c4[nH]ccc34)c2c1
: