Target
Muscarinic acetylcholine receptor M4
Ligand
BDBM280375
Substrate
Meas. Tech.
In Vitro M4 &M2 Functional Assay
EC50
250±n/a nM
Citation
 Livermore, DWhite, KCongreve, MBrown, GO Brien, M Piperidin-1-yl and azepin-1-yl carboxylates as muscarinic M4 receptor agonists US Patent  US10030012 Publication Date 7/24/2018 
Target
Name:
Muscarinic acetylcholine receptor M4
Synonyms:
ACM4_HUMAN Cholinergic, muscarinic M4 Muscarinic acetylcholine receptor M2 and M4
Type:
Enzyme Catalytic Domain
Mol. Mass.:
53079.31
Organism:
Homo sapiens (Human)
Description:
Cholinergic, muscarinic M4 CHRM4 HUMAN M3::P08173
Residue:
479
  
Inhibitor
Name:
BDBM280375
Synonyms:
US10030012, Example 5 | ethyl 4-{4-[5-(4- chlorophenyl)- 1H-pyrazol-1- yl]piperidin-1- yl}azepane-1- carboxylate
Type:
Small organic molecule
Emp. Form.:
C23H31ClN4O2
Mol. Mass.:
430.971
SMILES:
CCOC(=O)N1CCCC(CC1)N1CCC(CC1)n1nccc1-c1ccc(Cl)cc1
: