Target
Muscarinic acetylcholine receptor M2
Ligand
BDBM280375
Substrate
EC50
>10000000±n/a nM
Citation
 Livermore, DWhite, KCongreve, MBrown, GO Brien, M Piperidin-1-yl and azepin-1-yl carboxylates as muscarinic M4 receptor agonists US Patent  US10030012 Publication Date 7/24/2018 
Target
Name:
Muscarinic acetylcholine receptor M2
Synonyms:
ACM2_HUMAN Cholinergic, muscarinic M2 Muscarinic acetylcholine receptor M2 and M5 | RecName: Full=Muscarinic acetylcholine receptor M2
Type:
GPCR
Mol. Mass.:
51730.61
Organism:
Homo sapiens (Human)
Description:
P08172
Residue:
466
  
Inhibitor
Name:
BDBM280375
Synonyms:
US10030012, Example 5 | ethyl 4-{4-[5-(4- chlorophenyl)- 1H-pyrazol-1- yl]piperidin-1- yl}azepane-1- carboxylate
Type:
Small organic molecule
Emp. Form.:
C23H31ClN4O2
Mol. Mass.:
430.971
SMILES:
CCOC(=O)N1CCCC(CC1)N1CCC(CC1)n1nccc1-c1ccc(Cl)cc1
: