Target
Muscarinic acetylcholine receptor M4
Ligand
BDBM280428
Substrate
Meas. Tech.
In Vitro M4 &M2 Functional Assay
EC50
2.00±n/a nM
Citation
 Livermore, DWhite, KCongreve, MBrown, GO Brien, M Piperidin-1-yl and azepin-1-yl carboxylates as muscarinic M4 receptor agonists US Patent  US10030012 Publication Date 7/24/2018 
Target
Name:
Muscarinic acetylcholine receptor M4
Synonyms:
ACM4_HUMAN Cholinergic, muscarinic M4 Muscarinic acetylcholine receptor M2 and M4
Type:
Enzyme Catalytic Domain
Mol. Mass.:
53079.31
Organism:
Homo sapiens (Human)
Description:
Cholinergic, muscarinic M4 CHRM4 HUMAN M3::P08173
Residue:
479
  
Inhibitor
Name:
BDBM280428
Synonyms:
US10030012, Example 58 | ethyl 4-[4-(5- chloro-2- methoxy- pyridin-3- yl)piperidin-1- yl]azepane-1- carboxylate
Type:
Small organic molecule
Emp. Form.:
C20H30ClN3O3
Mol. Mass.:
395.924
SMILES:
CCOC(=O)N1CCCC(CC1)N1CCC(CC1)c1cc(Cl)cnc1OC
: