Target
Gag-Pol polyprotein
Ligand
BDBM99914
Substrate
Meas. Tech.
Enzyme Inhibition Assay
Ki
0.18±0.03 nM
Citation
 Ghosh, AK HIV protease inhibitors and methods for using US Patent  US8501961 Publication Date 8/6/2013 
Target
Name:
Gag-Pol polyprotein
Synonyms:
POL_HV1A2 gag-pol
Type:
Protein
Mol. Mass.:
162047.84
Organism:
Human immunodeficiency virus type 1 group M subtype B (isolate ARV2/SF2) (HIV-1)
Description:
P03369
Residue:
1437
  
Inhibitor
Name:
BDBM99914
Synonyms:
US8501961, 103
Type:
Small organic molecule
Emp. Form.:
C29H40N2O8S
Mol. Mass.:
576.701
SMILES:
COc1ccc(cc1)S(=O)(=O)N(CC(C)C)C[C@@H](O)[C@H](Cc1ccccc1)NC(=O)OC1CC2OCCO[C@@H]2C1
: