Target
Kallikrein-7
Ligand
BDBM99997
Substrate
EC50
>69493±n/a nM
Citation
 PubChem, PC Fluorescence Intensity-based biochemical primary high throughput dose response assay to identify activators of kallikrein-7 (K7) zymogen PubChem Bioassay (2013)[AID] 
Target
Name:
Kallikrein-7
Synonyms:
KLK7 Kallikrein 7 PRSS6 Serine protease 6 hK7 kallikrein-7 isoform 1 preproprotein
Type:
PROTEIN
Mol. Mass.:
27535.05
Organism:
Homo sapiens (Human)
Description:
ChEMBL_1469257
Residue:
253
  
Inhibitor
Name:
BDBM99997
Synonyms:
2-(1,3-benzodioxol-5-yl)-1,3-dimethyl-2H-quinazolin-4-one MLS000027905 cid_648889
Type:
Small organic molecule
Emp. Form.:
C17H16N2O3
Mol. Mass.:
296.3205
SMILES:
CN1C(N(C)c2ccccc2C1=O)c1ccc2OCOc2c1
: