Target
Kallikrein-7
Ligand
BDBM100185
Substrate
EC50
>7724±n/a nM
Citation
 PubChem, PC Fluorescence Intensity-based biochemical primary high throughput dose response assay to identify activators of kallikrein-7 (K7) zymogen PubChem Bioassay (2013)[AID] 
Target
Name:
Kallikrein-7
Synonyms:
KLK7 Kallikrein 7 PRSS6 Serine protease 6 hK7 kallikrein-7 isoform 1 preproprotein
Type:
PROTEIN
Mol. Mass.:
27535.05
Organism:
Homo sapiens (Human)
Description:
ChEMBL_1469257
Residue:
253
  
Inhibitor
Name:
BDBM100185
Synonyms:
MLS003124389 [3-[6-(methylamino)-3-pyridinyl]phenyl]methanol [3-[6-(methylamino)pyridin-3-yl]phenyl]methanol | cid_49795255
Type:
Small organic molecule
Emp. Form.:
C13H14N2O
Mol. Mass.:
214.2631
SMILES:
CNc1ccc(cn1)-c1cccc(CO)c1
: