Target
Toll-like receptor 9
Ligand
BDBM83279
Substrate
IC50
155±n/a nM
Citation
 PubChem, PC Late stage assay provider counterscreen for TLR9 inhibitors: Luminescence-based assay to identify inhibitors of TLR9-dependent cell activation using RAW264.7 cells PubChem Bioassay (2013)[AID] 
Target
Name:
Toll-like receptor 9
Synonyms:
CD_antigen: CD289 TLR9_HUMAN
Type:
Enzyme
Mol. Mass.:
115889.91
Organism:
Homo sapiens (Human)
Description:
Q9NR96
Residue:
1032
  
Inhibitor
Name:
BDBM83279
Synonyms:
(2R,3R)-2,3-bis(phenylmethyl)-1,4-dioxaspiro[4.5]deca-6,9-dien-8-one MLS002702492 cid_404470
Type:
Small organic molecule
Emp. Form.:
C22H20O3
Mol. Mass.:
332.3924
SMILES:
O=C1C=CC2(O[C@H](Cc3ccccc3)[C@@H](Cc3ccccc3)O2)C=C1
: