Target
Dimer of Gag-Pol polyprotein [489-587]
Ligand
BDBM4134
Substrate
HIV Protease Peptide Substrate
Meas. Tech.
Protease Inhibition Assay
IC50
0.6±n/a nM
Citation
 Takashiro, EHayakawa, INitta, TKasuya, AMiyamoto, SOzawa, YYagi, RYamamoto, IShibayama, TNakagawa, AYabe, Y Structure-activity relationship of HIV-1 protease inhibitors containing alpha-hydroxy-beta-amino acids. Detailed study of P1 site. Bioorg Med Chem 7:2063-72 (1999)  
Target
Name:
Dimer of Gag-Pol polyprotein [489-587]
Synonyms:
HIV-1 Protease
Type:
Protein Complex
Mol. Mass.:
Description:
Components:
This complex has 2 components.
Component 1
Name:
Gag-Pol polyprotein [489-587]
Synonyms:
HIV protease HIV-1 Protease chain A POL_HV1N5 | gag-pol
Type:
Enzyme Subunit
Mol. Mass.:
10822.21
Organism:
Human immunodeficiency virus type 1
Description:
P12497[489-587]
Residue:
99
  
Component 2
Name:
Gag-Pol polyprotein [489-587]
Synonyms:
HIV protease HIV-1 Protease chain A POL_HV1N5 | gag-pol
Type:
Enzyme Subunit
Mol. Mass.:
10822.21
Organism:
Human immunodeficiency virus type 1
Description:
P12497[489-587]
Residue:
99
  
Inhibitor
Name:
BDBM4134
Synonyms:
(2S,4S)-N-tert-butyl-4-chloro-1-[(2S,3S)-2-hydroxy-3-[(3-hydroxy-2-methylphenyl)formamido]-4-[4-(trifluoromethyl)phenyl]butanoyl]pyrrolidine-2-carboxamide AHPBA deriv. 19
Type:
Small organic molecule
Emp. Form.:
C28H33ClF3N3O5
Mol. Mass.:
584.027
SMILES:
Cc1c(O)cccc1C(=O)N[C@@H](Cc1ccc(cc1)C(F)(F)F)[C@H](O)C(=O)N1C[C@@H](Cl)C[C@H]1C(=O)NC(C)(C)C
:
Substrate
Name:
HIV Protease Peptide Substrate
Synonyms:
Type:
Peptide
Mol. Mass.:
2686.50
Organism:
Description:
Residue:
24